{"text_format":"1","workbook":"xlsx","n_sheets":24,"sheets":["学校情報入力","設定情報","青森県高等学校住所一覧","昨年度登録データ","男子部員名簿","女子部員名簿","男子登録用紙","女子登録用紙","男子登録票（協会用）","女子登録票（協会用）","春季地区予選男子エントリー用紙","春季地区予選女子エントリー用紙","県春季男子エントリー用紙","県春季女子エントリー用紙","総体男子団体エントリー用紙","総体女子団体エントリー用紙","総体男子個人戦エントリー用紙","総体女子個人戦エントリー用紙","新人戦地区予選男子エントリー用紙","新人戦地区予選女子エントリー用紙","新人戦男子エントリー用紙","新人戦女子エントリー用紙","室内男子エントリー用紙","室内女子エントリー用紙"],"not_rendered":{"charts":0,"images":0,"macros":1,"external_links":0,"defined_names":20,"comments":0,"pivot_tables":0},"unopened":[],"bounds":{"document_bytes":16777216,"sheet_cells":100000,"rows_first":2000,"rows_last":500,"rows_between":2000,"halvings":0,"cell_chars":16384,"cell_head_chars":4096},"cells_cut":0,"cells_raw":0,"read":"whole","date_system":"1900"}

{"sheet":"学校情報入力","index":0,"n_rows":28,"n_cols":7,"rows_kept":28,"cut":false,"hidden":false,"merged":[[0,1,0,2],[2,1,2,2],[3,1,3,2],[4,1,4,2],[6,1,6,2],[5,1,5,2],[1,1,1,2]]}
["学校名"]
["男女別"]
["郵便番号",{"$f":"VLOOKUP(B$1,青森県高等学校住所一覧!$A$2:$E$79,2,0)","v":{"$error":"#N/A"}}]
["所在地",{"$f":"VLOOKUP(B$1,青森県高等学校住所一覧!$A$2:$E$79,3,0)","v":{"$error":"#N/A"}}]
["TEL",{"$f":"VLOOKUP(B$1,青森県高等学校住所一覧!$A$2:$E$79,4,0)","v":{"$error":"#N/A"}}]
["FAX",{"$f":"VLOOKUP(B$1,青森県高等学校住所一覧!$A$2:$E$79,5,0)","v":{"$error":"#N/A"}}]
{"$rows_left_out":23}
{"sheet":"設定情報","index":1,"n_rows":8,"n_cols":2,"rows_kept":8,"cut":false,"hidden":true,"merged":[]}
["年度起算日","2022-04-01"]
["県春季申込期限","2022-05-05"]
["総体申込期限","2022-05-24"]
["新人戦申込期限","2022-09-06"]
["室内申込期限","2022-12-13"]
[]
{"$rows_left_out":3}
{"sheet":"青森県高等学校住所一覧","index":2,"n_rows":79,"n_cols":7,"rows_kept":79,"cut":false,"hidden":true,"merged":[]}
["学校名","郵便番号","住所","電話番号","FAX番号","略名","所属_ID"]
["青森県立青森高等学校","030-0945","青森市桜川八丁目1の2","017-742-2411","017-742-6074","青　森","AM3905"]
["青森県立青森西高等学校","038-0042","青森市新城平岡266の20","017-788-0372","017-788-4411","青森西","AM3907"]
["青森県立青森東高等学校","030-0921","青森市原別三丁目1の1","017-736-2440","017-736-3091","青森東","AM3906"]
["青森県立青森東高等学校平内校舎","039-3321","東津軽郡平内町小湊新道46の26","017-755-2333","017-755-4040","平内校舎"]
["青森県立青森北高等学校","038-0058","青森市羽白富田80の7","017-788-2893","017-787-2024","青森北","AM3909"]
{"$rows_left_out":74}
{"sheet":"昨年度登録データ","index":3,"n_rows":1,"n_cols":18,"rows_kept":1,"cut":false,"hidden":true,"merged":[]}
["Memberid","Clubnumber","MembershipType","Prefecture","Prefecturememberid","Birthdate","Gender","Lastname","Firstname","Lastname_kana","Firstname_kana","Lastname_alphabet","Firstname_alphabet","Country","IPIN","Email","School","Grade"]

{"sheet":"男子部員名簿","index":4,"n_rows":101,"n_cols":14,"rows_kept":101,"cut":false,"hidden":false,"merged":[]}
["No","県ＩＤ","学年","組","姓","名","フリガナ（姓）","フリガナ（名）","生年月日(西暦)","年齢","保護者名・印","現住所","TEL",{"$f":"COUNTIF($N$2:$N$97,TRUE)","v":0}]
[1,null,null,null,null,null,null,null,null,{"$f":"IF($I2=\"\",\"\",DATEDIF(I2,設定情報!$B$1,\"Y\"))","v":""},null,null,null,{"$f":"AND(C2<>\"\",E2<>\"\",F2<>\"\",G2<>\"\",H2<>\"\",I2<>\"\")","v":false}]
[2,null,null,null,null,null,null,null,null,{"$f":"IF($I3=\"\",\"\",DATEDIF(I3,設定情報!$B$1,\"Y\"))","v":""},null,null,null,{"$f":"AND(C3<>\"\",E3<>\"\",F3<>\"\",G3<>\"\",H3<>\"\",I3<>\"\")","v":false}]
[3,null,null,null,null,null,null,null,null,{"$f":"IF($I4=\"\",\"\",DATEDIF(I4,設定情報!$B$1,\"Y\"))","v":""},null,null,null,false]
[4,null,null,null,null,null,null,null,null,{"$f":"IF($I5=\"\",\"\",DATEDIF(I5,設定情報!$B$1,\"Y\"))","v":""},null,null,null,false]
[5,null,null,null,null,null,null,null,null,{"$f":"IF($I6=\"\",\"\",DATEDIF(I6,設定情報!$B$1,\"Y\"))","v":""},null,null,null,false]
{"$rows_left_out":96}
{"sheet":"女子部員名簿","index":5,"n_rows":101,"n_cols":14,"rows_kept":101,"cut":false,"hidden":false,"merged":[]}
["No","県ＩＤ","学年","組","姓","名","フリガナ（姓)","フリガナ（名)","生年月日(西暦)","年齢","保護者名・印","現住所","TEL",{"$f":"COUNTIF($N$2:$N$97,TRUE)","v":0}]
[1,null,null,null,null,null,null,null,null,{"$f":"IF($I2=\"\",\"\",DATEDIF(I2,設定情報!$B$1,\"Y\"))","v":""},null,null,null,{"$f":"AND(C2<>\"\",E2<>\"\",F2<>\"\",G2<>\"\",H2<>\"\",I2<>\"\")","v":false}]
[2,null,null,null,null,null,null,null,null,{"$f":"IF($I3=\"\",\"\",DATEDIF(I3,設定情報!$B$1,\"Y\"))","v":""},null,null,null,{"$f":"AND(C3<>\"\",E3<>\"\",F3<>\"\",G3<>\"\",H3<>\"\",I3<>\"\")","v":false}]
[3,null,null,null,null,null,null,null,null,{"$f":"IF($I4=\"\",\"\",DATEDIF(I4,設定情報!$B$1,\"Y\"))","v":""},null,null,null,false]
[4,null,null,null,null,null,null,null,null,{"$f":"IF($I5=\"\",\"\",DATEDIF(I5,設定情報!$B$1,\"Y\"))","v":""},null,null,null,false]
[5,null,null,null,null,null,null,null,null,{"$f":"IF($I6=\"\",\"\",DATEDIF(I6,設定情報!$B$1,\"Y\"))","v":""},null,null,null,false]
{"$rows_left_out":96}
{"sheet":"男子登録用紙","index":6,"n_rows":54,"n_cols":11,"rows_kept":54,"cut":false,"hidden":true,"merged":[[12,9,13,10],[13,7,13,8],[11,7,11,8],[2,9,2,10],[8,9,9,10],[12,7,12,8],[7,7,7,8],[10,0,11,2],[10,3,11,3],[10,4,11,6],[10,9,11,10],[7,9,7,10],[9,7,9,8],[8,7,8,8],[10,7,10,8],[50,1,50,10],[23,1,23,2],[24,1,24,2],[25,1,25,2],[26,1,26,2],[27,1,27,2],[28,1,28,2],[29,1,29,2],[30,1,30,2],[31,1,31,2],[32,1,32,2],[33,1,33,2],[49,1,49,10],[41,1,41,2],[47,1,47,2],[42,1,42,2],[22,1,22,2],[0,3,0,4],[39,1,39,2],[8,4,9,6],[8,0,9,2],[8,3,9,3],[12,4,13,6],[17,1,17,3],[21,1,21,2],[4,2,4,5],[6,4,6,10],[4,0,4,1],[7,4,7,6],[4,6,4,7],[6,0,6,1],[7,0,7,2],[17,7,17,8],[12,3,13,3],[18,1,18,2],[19,1,19,2],[20,1,20,2],[12,0,13,2],[43,1,43,2],[44,1,44,2],[45,1,45,2],[46,1,46,2],[34,1,34,2],[35,1,35,2],[36,1,36,2],[37,1,37,2],[38,1,38,2],[40,1,40,2]]}
[null,null,null,{"$f":"YEAR(設定情報!B1)","v":2022},null,"年度　庭球競技登録用紙"]
[null,null,null,null,null,"(種別","・","男子)"]
[null,null,null,null,null,null,null,"　　　　　　記載年月日：",null,{"$f":"NOW()","v":"2022-04-18T16:23:01.390"}]
[null,null,null,null,null,null,null,null,{"$f":"T(学校情報入力!B21)","v":""},null,{"$f":"T(学校情報入力!B26)","v":""}]
["学校名",null,{"$f":"T(学校情報入力!B1)","v":""},null,null,null,"引率責任者名",null,{"$f":"T(学校情報入力!B22)","v":""},"監督名",{"$f":"T(学校情報入力!B27)","v":""}]
[null,null,"TEL",{"$f":"学校情報入力!B5","v":{"$error":"#N/A"}},"FAX",{"$f":"学校情報入力!B6","v":{"$error":"#N/A"}},null,null,{"$f":"T(学校情報入力!B23)","v":""},null,{"$f":"T(学校情報入力!B28)","v":""}]
{"$rows_left_out":49}
{"sheet":"女子登録用紙","index":7,"n_rows":54,"n_cols":11,"rows_kept":54,"cut":false,"hidden":true,"merged":[[17,7,17,8],[12,3,13,3],[12,7,12,8],[10,7,10,8],[11,7,11,8],[12,9,13,10],[10,9,11,10],[13,7,13,8],[12,4,13,6],[2,9,2,10],[7,9,7,10],[8,9,9,10],[8,7,8,8],[9,7,9,8],[4,6,4,7],[38,1,38,2],[47,1,47,2],[4,0,4,1],[4,2,4,5],[6,0,6,1],[6,4,6,10],[7,0,7,2],[8,0,9,2],[8,3,9,3],[8,4,9,6],[7,4,7,6],[7,7,7,8],[12,0,13,2],[10,0,11,2],[10,3,11,3],[10,4,11,6],[50,1,50,10],[39,1,39,2],[40,1,40,2],[41,1,41,2],[42,1,42,2],[43,1,43,2],[44,1,44,2],[45,1,45,2],[46,1,46,2],[49,1,49,10],[37,1,37,2],[28,1,28,2],[29,1,29,2],[30,1,30,2],[31,1,31,2],[32,1,32,2],[0,3,0,4],[33,1,33,2],[34,1,34,2],[35,1,35,2],[36,1,36,2],[23,1,23,2],[24,1,24,2],[25,1,25,2],[26,1,26,2],[27,1,27,2],[18,1,18,2],[19,1,19,2],[20,1,20,2],[21,1,21,2],[22,1,22,2],[17,1,17,3]]}
[null,null,null,{"$f":"YEAR(設定情報!B1)","v":2022},null,"年度　庭球競技登録用紙"]
[null,null,null,null,null,"(種別","・","女子)"]
[null,null,null,null,null,null,null,"　　　　　　記載年月日：",null,{"$f":"NOW()","v":"2022-04-18T16:23:01.390"}]
[null,null,null,null,null,null,null,null,{"$f":"T(学校情報入力!C21)","v":""},null,{"$f":"T(学校情報入力!C26)","v":""}]
["学校名",null,{"$f":"T(学校情報入力!B1)","v":""},null,null,null,"引率責任者名",null,{"$f":"T(学校情報入力!C22)","v":""},"監督名",{"$f":"T(学校情報入力!C27)","v":""}]
[null,null,"TEL",{"$f":"学校情報入力!B5","v":{"$error":"#N/A"}},"FAX",{"$f":"学校情報入力!B6","v":{"$error":"#N/A"}},null,null,{"$f":"T(学校情報入力!C23)","v":""},null,{"$f":"T(学校情報入力!C28)","v":""}]
{"$rows_left_out":49}
{"sheet":"男子登録票（協会用）","index":8,"n_rows":228,"n_cols":18,"rows_kept":228,"cut":false,"hidden":true,"merged":[]}
["Memberid","Clubnumber","MembershipType","Prefecture","Prefecturememberid","Birthdate","Gender","Lastname","Firstname","Lastname_kana","Firstname_kana","Lastname_alphabet","Firstname_alphabet","Country","IPIN","Email","Teamname","Grade"]
[{"$f":"IF(E2=\"\",\"\",INDEX(昨年度登録データ!$A$2:$A$1000,MATCH(E2,昨年度登録データ!$E$2:$E$1000,0)))","v":""},{"$f":"IF(H2<>\"\",VLOOKUP(学校情報入力!$B$1,青森県高等学校住所一覧!$A$2:$G$79,7,0),\"\")","v":""},{"$f":"IF(H2<>\"\",\"JTAジュニア選手登録\",\"\")","v":""},{"$f":"IF(H2<>\"\",\"PF02\",\"\")","v":""},{"$f":"IF(男子部員名簿!B2=\"\",\"\",N(男子部員名簿!B2))","v":""},{"$f":"IF(H2<>\"\",男子部員名簿!I2,\"\")","v":""},{"$f":"IF(H2<>\"\",\"M\",\"\")","v":""},{"$f":"T(男子部員名簿!E2)","v":""},{"$f":"T(男子部員名簿!F2)","v":""},{"$f":"PHONETIC(男子部員名簿!G2)","v":""},{"$f":"PHONETIC(男子部員名簿!H2)","v":""},null,null,null,null,null,{"$f":"IF(H2<>\"\",学校情報入力!$B$1,\"\")","v":""},{"$f":"IF(男子部員名簿!C2=\"\",\"\",N(男子部員名簿!C2))","v":""}]
[{"$f":"IF(E3=\"\",\"\",INDEX(昨年度登録データ!$A$2:$A$1000,MATCH(E3,昨年度登録データ!$E$2:$E$1000,0)))","v":""},{"$f":"IF(H3<>\"\",VLOOKUP(学校情報入力!$B$1,青森県高等学校住所一覧!$A$2:$G$79,7,0),\"\")","v":""},{"$f":"IF(H3<>\"\",\"JTAジュニア選手登録\",\"\")","v":""},{"$f":"IF(H3<>\"\",\"PF02\",\"\")","v":""},{"$f":"IF(男子部員名簿!B3=\"\",\"\",N(男子部員名簿!B3))","v":""},{"$f":"IF(H3<>\"\",男子部員名簿!I3,\"\")","v":""},"",{"$f":"T(男子部員名簿!E3)","v":""},{"$f":"T(男子部員名簿!F3)","v":""},{"$f":"PHONETIC(男子部員名簿!G3)","v":""},{"$f":"PHONETIC(男子部員名簿!H3)","v":""},null,null,null,null,null,{"$f":"IF(H3<>\"\",学校情報入力!$B$1,\"\")","v":""},{"$f":"IF(男子部員名簿!C3=\"\",\"\",N(男子部員名簿!C3))","v":""}]
[{"$f":"IF(E4=\"\",\"\",INDEX(昨年度登録データ!$A$2:$A$1000,MATCH(E4,昨年度登録データ!$E$2:$E$1000,0)))","v":""},{"$f":"IF(H4<>\"\",VLOOKUP(学校情報入力!$B$1,青森県高等学校住所一覧!$A$2:$G$79,7,0),\"\")","v":""},"","",{"$f":"IF(男子部員名簿!B4=\"\",\"\",N(男子部員名簿!B4))","v":""},{"$f":"IF(H4<>\"\",男子部員名簿!I4,\"\")","v":""},"",{"$f":"T(男子部員名簿!E4)","v":""},{"$f":"T(男子部員名簿!F4)","v":""},{"$f":"PHONETIC(男子部員名簿!G4)","v":""},{"$f":"PHONETIC(男子部員名簿!H4)","v":""},null,null,null,null,null,{"$f":"IF(H4<>\"\",学校情報入力!$B$1,\"\")","v":""},{"$f":"IF(男子部員名簿!C4=\"\",\"\",N(男子部員名簿!C4))","v":""}]
[{"$f":"IF(E5=\"\",\"\",INDEX(昨年度登録データ!$A$2:$A$1000,MATCH(E5,昨年度登録データ!$E$2:$E$1000,0)))","v":""},{"$f":"IF(H5<>\"\",VLOOKUP(学校情報入力!$B$1,青森県高等学校住所一覧!$A$2:$G$79,7,0),\"\")","v":""},"","",{"$f":"IF(男子部員名簿!B5=\"\",\"\",N(男子部員名簿!B5))","v":""},{"$f":"IF(H5<>\"\",男子部員名簿!I5,\"\")","v":""},"",{"$f":"T(男子部員名簿!E5)","v":""},{"$f":"T(男子部員名簿!F5)","v":""},{"$f":"PHONETIC(男子部員名簿!G5)","v":""},{"$f":"PHONETIC(男子部員名簿!H5)","v":""},null,null,null,null,null,{"$f":"IF(H5<>\"\",学校情報入力!$B$1,\"\")","v":""},{"$f":"IF(男子部員名簿!C5=\"\",\"\",N(男子部員名簿!C5))","v":""}]
[{"$f":"IF(E6=\"\",\"\",INDEX(昨年度登録データ!$A$2:$A$1000,MATCH(E6,昨年度登録データ!$E$2:$E$1000,0)))","v":""},{"$f":"IF(H6<>\"\",VLOOKUP(学校情報入力!$B$1,青森県高等学校住所一覧!$A$2:$G$79,7,0),\"\")","v":""},"","",{"$f":"IF(男子部員名簿!B6=\"\",\"\",N(男子部員名簿!B6))","v":""},{"$f":"IF(H6<>\"\",男子部員名簿!I6,\"\")","v":""},"",{"$f":"T(男子部員名簿!E6)","v":""},{"$f":"T(男子部員名簿!F6)","v":""},{"$f":"PHONETIC(男子部員名簿!G6)","v":""},{"$f":"PHONETIC(男子部員名簿!H6)","v":""},null,null,null,null,null,{"$f":"IF(H6<>\"\",学校情報入力!$B$1,\"\")","v":""},{"$f":"IF(男子部員名簿!C6=\"\",\"\",N(男子部員名簿!C6))","v":""}]
{"$rows_left_out":223}
{"sheet":"女子登録票（協会用）","index":9,"n_rows":228,"n_cols":18,"rows_kept":228,"cut":false,"hidden":true,"merged":[]}
["Memberid","Clubnumber","MembershipType","Prefecture","Prefecturememberid","Birthdate","Gender","Lastname","Firstname","Lastname_kana","Firstname_kana","Lastname_alphabet","Firstname_alphabet","Country","IPIN","Email","Teamname","Grade"]
[{"$f":"IF(E2=\"\",\"\",INDEX(昨年度登録データ!$A$2:$A$1000,MATCH(E2,昨年度登録データ!$E$2:$E$1000,0)))","v":""},{"$f":"IF(H2<>\"\",VLOOKUP(学校情報入力!$B$1,青森県高等学校住所一覧!$A$2:$G$79,7,0),\"\")","v":""},{"$f":"IF(H2<>\"\",\"JTAジュニア選手登録\",\"\")","v":""},{"$f":"IF(H2<>\"\",\"PF02\",\"\")","v":""},{"$f":"IF(女子部員名簿!B2=\"\",\"\",N(女子部員名簿!B2))","v":""},{"$f":"IF(H2<>\"\",女子部員名簿!I2,\"\")","v":""},{"$f":"IF(H2<>\"\",\"F\",\"\")","v":""},{"$f":"T(女子部員名簿!E2)","v":""},{"$f":"T(女子部員名簿!F2)","v":""},{"$f":"PHONETIC(女子部員名簿!G2)","v":""},{"$f":"PHONETIC(女子部員名簿!H2)","v":""},null,null,null,null,null,{"$f":"IF(H2<>\"\",学校情報入力!$B$1,\"\")","v":""},{"$f":"IF(女子部員名簿!C2=\"\",\"\",N(女子部員名簿!C2))","v":""}]
[{"$f":"IF(E3=\"\",\"\",INDEX(昨年度登録データ!$A$2:$A$1000,MATCH(E3,昨年度登録データ!$E$2:$E$1000,0)))","v":""},{"$f":"IF(H3<>\"\",VLOOKUP(学校情報入力!$B$1,青森県高等学校住所一覧!$A$2:$G$79,7,0),\"\")","v":""},{"$f":"IF(H3<>\"\",\"JTAジュニア選手登録\",\"\")","v":""},{"$f":"IF(H3<>\"\",\"PF02\",\"\")","v":""},{"$f":"IF(女子部員名簿!B3=\"\",\"\",N(女子部員名簿!B3))","v":""},{"$f":"IF(H3<>\"\",女子部員名簿!I3,\"\")","v":""},"",{"$f":"T(女子部員名簿!E3)","v":""},{"$f":"T(女子部員名簿!F3)","v":""},{"$f":"PHONETIC(女子部員名簿!G3)","v":""},{"$f":"PHONETIC(女子部員名簿!H3)","v":""},null,null,null,null,null,{"$f":"IF(H3<>\"\",学校情報入力!$B$1,\"\")","v":""},{"$f":"IF(女子部員名簿!C3=\"\",\"\",N(女子部員名簿!C3))","v":""}]
[{"$f":"IF(E4=\"\",\"\",INDEX(昨年度登録データ!$A$2:$A$1000,MATCH(E4,昨年度登録データ!$E$2:$E$1000,0)))","v":""},{"$f":"IF(H4<>\"\",VLOOKUP(学校情報入力!$B$1,青森県高等学校住所一覧!$A$2:$G$79,7,0),\"\")","v":""},"","",{"$f":"IF(女子部員名簿!B4=\"\",\"\",N(女子部員名簿!B4))","v":""},{"$f":"IF(H4<>\"\",女子部員名簿!I4,\"\")","v":""},"",{"$f":"T(女子部員名簿!E4)","v":""},{"$f":"T(女子部員名簿!F4)","v":""},{"$f":"PHONETIC(女子部員名簿!G4)","v":""},{"$f":"PHONETIC(女子部員名簿!H4)","v":""},null,null,null,null,null,{"$f":"IF(H4<>\"\",学校情報入力!$B$1,\"\")","v":""},{"$f":"IF(女子部員名簿!C4=\"\",\"\",N(女子部員名簿!C4))","v":""}]
[{"$f":"IF(E5=\"\",\"\",INDEX(昨年度登録データ!$A$2:$A$1000,MATCH(E5,昨年度登録データ!$E$2:$E$1000,0)))","v":""},{"$f":"IF(H5<>\"\",VLOOKUP(学校情報入力!$B$1,青森県高等学校住所一覧!$A$2:$G$79,7,0),\"\")","v":""},"","",{"$f":"IF(女子部員名簿!B5=\"\",\"\",N(女子部員名簿!B5))","v":""},{"$f":"IF(H5<>\"\",女子部員名簿!I5,\"\")","v":""},"",{"$f":"T(女子部員名簿!E5)","v":""},{"$f":"T(女子部員名簿!F5)","v":""},{"$f":"PHONETIC(女子部員名簿!G5)","v":""},{"$f":"PHONETIC(女子部員名簿!H5)","v":""},null,null,null,null,null,{"$f":"IF(H5<>\"\",学校情報入力!$B$1,\"\")","v":""},{"$f":"IF(女子部員名簿!C5=\"\",\"\",N(女子部員名簿!C5))","v":""}]
[{"$f":"IF(E6=\"\",\"\",INDEX(昨年度登録データ!$A$2:$A$1000,MATCH(E6,昨年度登録データ!$E$2:$E$1000,0)))","v":""},{"$f":"IF(H6<>\"\",VLOOKUP(学校情報入力!$B$1,青森県高等学校住所一覧!$A$2:$G$79,7,0),\"\")","v":""},"","",{"$f":"IF(女子部員名簿!B6=\"\",\"\",N(女子部員名簿!B6))","v":""},{"$f":"IF(H6<>\"\",女子部員名簿!I6,\"\")","v":""},"",{"$f":"T(女子部員名簿!E6)","v":""},{"$f":"T(女子部員名簿!F6)","v":""},{"$f":"PHONETIC(女子部員名簿!G6)","v":""},{"$f":"PHONETIC(女子部員名簿!H6)","v":""},null,null,null,null,null,{"$f":"IF(H6<>\"\",学校情報入力!$B$1,\"\")","v":""},{"$f":"IF(女子部員名簿!C6=\"\",\"\",N(女子部員名簿!C6))","v":""}]
{"$rows_left_out":223}
{"sheet":"春季地区予選男子エントリー用紙","index":10,"n_rows":113,"n_cols":7,"rows_kept":113,"cut":false,"hidden":false,"merged":[[0,0,0,5],[26,0,26,5],[58,0,58,5],[4,1,4,4],[30,1,30,4],[24,0,25,0],[22,0,23,0],[14,0,15,0],[16,0,17,0],[20,0,21,0],[6,0,7,0],[8,0,9,0],[10,0,11,0],[12,0,13,0],[18,0,19,0],[5,1,5,2],[31,1,31,2],[63,1,63,2],[92,1,92,2],[62,1,62,4],[91,1,91,4],[87,0,87,5],[64,0,65,0],[66,0,67,0],[68,0,69,0],[70,0,71,0],[72,0,73,0],[74,0,75,0],[76,0,77,0],[78,0,79,0],[80,0,81,0],[82,0,83,0]]}
[{"$f":"設定情報!$B$1","v":"2022-04-01"}]
[]
["*個人戦ダブルス(各地区の申込期限を厳守のこと)"]
[]
["学校名",{"$f":"男子登録用紙!C5","v":""},null,null,null,"男子","部員名簿のNo欄の番号を入力してください。"]
["校内順位","選手氏名",null,"学年","生年月日","主な大会成績","↓"]
{"$rows_left_out":108}
{"sheet":"春季地区予選女子エントリー用紙","index":11,"n_rows":113,"n_cols":7,"rows_kept":113,"cut":false,"hidden":false,"merged":[[30,1,30,4],[26,0,26,5],[24,0,25,0],[22,0,23,0],[14,0,15,0],[16,0,17,0],[18,0,19,0],[20,0,21,0],[10,0,11,0],[12,0,13,0],[6,0,7,0],[8,0,9,0],[0,0,0,5],[4,1,4,4],[5,1,5,2],[31,1,31,2],[58,0,58,5],[62,1,62,4],[63,1,63,2],[64,0,65,0],[66,0,67,0],[68,0,69,0],[70,0,71,0],[72,0,73,0],[74,0,75,0],[92,1,92,2],[87,0,87,5],[76,0,77,0],[78,0,79,0],[80,0,81,0],[82,0,83,0],[91,1,91,4]]}
[{"$f":"設定情報!$B$1","v":"2022-04-01"}]
[]
["*個人戦ダブルス(各地区の申込期限を厳守のこと)"]
[]
["学校名",{"$f":"女子登録用紙!C5","v":""},null,null,null,"女子","部員名簿のNo欄の番号を入力してください。"]
["校内順位","選手氏名",null,"学年","生年月日","主な大会成績","↓"]
{"$rows_left_out":108}
{"sheet":"県春季男子エントリー用紙","index":12,"n_rows":58,"n_cols":13,"rows_kept":58,"cut":false,"hidden":false,"merged":[[9,0,10,0],[11,0,12,0],[3,0,3,11],[23,11,24,11],[21,11,22,11],[13,0,14,0],[15,0,16,0],[23,0,24,0],[21,10,22,10],[23,10,24,10],[13,10,14,10],[17,0,18,0],[19,0,20,0],[9,11,10,11],[9,10,10,10],[15,10,16,10],[0,0,0,11],[5,8,5,11],[6,5,6,11],[7,11,8,11],[6,0,8,0],[7,10,8,10],[6,3,8,3],[6,4,8,4],[7,5,7,9],[5,1,5,7],[6,1,8,2],[15,11,16,11],[27,10,28,10],[27,11,28,11],[25,10,26,10],[13,11,14,11],[25,11,26,11],[17,10,18,10],[17,11,18,11],[19,10,20,10],[19,11,20,11],[11,10,12,10],[11,11,12,11],[34,8,34,11],[34,1,34,7],[57,10,57,11],[53,10,53,11],[54,10,54,11],[55,10,55,11],[56,10,56,11],[43,10,43,11],[36,10,37,11],[38,10,38,11],[39,10,39,11],[35,5,35,11],[40,10,40,11],[41,10,41,11],[29,0,29,11],[27,0,28,0],[21,0,22,0],[25,0,26,0],[32,0,32,11],[52,10,52,11],[44,10,44,11],[45,10,45,11],[46,10,46,11],[47,10,47,11],[48,10,48,11],[49,10,49,11],[50,10,50,11],[51,10,51,11],[42,10,42,11],[36,5,36,9],[35,0,37,0],[35,3,37,3],[35,1,37,2],[35,4,37,4]]}
[{"$f":"設定情報!$B$1","v":"2022-04-01"}]
[]
["*個人戦ダブルス"]
[{"$f":"設定情報!$B$2","v":"2022-05-05"}]
[]
["学校名",{"$f":"男子登録用紙!C5","v":""},null,null,null,null,null,null,"男子"]
{"$rows_left_out":53}
{"sheet":"県春季女子エントリー用紙","index":13,"n_rows":58,"n_cols":13,"rows_kept":58,"cut":false,"hidden":false,"merged":[[17,0,18,0],[19,0,20,0],[9,0,10,0],[11,0,12,0],[3,0,3,11],[13,0,14,0],[15,0,16,0],[13,10,14,10],[9,11,10,11],[9,10,10,10],[15,10,16,10],[15,11,16,11],[11,10,12,10],[11,11,12,11],[13,11,14,11],[17,10,18,10],[0,0,0,11],[5,8,5,11],[6,5,6,11],[7,11,8,11],[6,0,8,0],[7,10,8,10],[6,3,8,3],[6,4,8,4],[7,5,7,9],[5,1,5,7],[6,1,8,2],[25,11,26,11],[21,10,22,10],[23,10,24,10],[23,11,24,11],[21,11,22,11],[17,11,18,11],[19,10,20,10],[19,11,20,11],[42,10,42,11],[29,0,29,11],[27,0,28,0],[32,0,32,11],[21,0,22,0],[35,0,37,0],[35,3,37,3],[35,1,37,2],[35,4,37,4],[25,0,26,0],[34,8,34,11],[34,1,34,7],[23,0,24,0],[35,5,35,11],[40,10,40,11],[41,10,41,11],[36,5,36,9],[57,10,57,11],[53,10,53,11],[54,10,54,11],[55,10,55,11],[56,10,56,11],[27,10,28,10],[27,11,28,11],[25,10,26,10],[52,10,52,11],[44,10,44,11],[45,10,45,11],[46,10,46,11],[47,10,47,11],[48,10,48,11],[49,10,49,11],[50,10,50,11],[51,10,51,11],[43,10,43,11],[36,10,37,11],[38,10,38,11],[39,10,39,11]]}
[{"$f":"設定情報!$B$1","v":"2022-04-01"}]
[]
["*個人戦ダブルス"]
[{"$f":"設定情報!$B$2","v":"2022-05-05"}]
[]
["学校名",{"$f":"女子登録用紙!C5","v":""},null,null,null,null,null,null,"女子"]
{"$rows_left_out":53}
{"sheet":"総体男子団体エントリー用紙","index":14,"n_rows":16,"n_cols":11,"rows_kept":16,"cut":false,"hidden":false,"merged":[[5,1,5,7],[6,1,6,9],[15,1,15,6],[0,0,0,9],[5,8,5,9],[8,5,8,9],[7,5,7,9],[7,0,9,0],[7,3,9,3],[7,4,9,4],[7,1,9,2],[3,0,3,9]]}
[{"$f":"設定情報!$B$1","v":"2022-04-01"}]
[]
["　　*　実施要項の \"７　競技方法\" および \"１０　エントリー方法\" を熟読の上、記入すること。"]
[{"$f":"設定情報!$B$3","v":"2022-05-24"}]
[]
["学校名",{"$f":"男子登録用紙!C5","v":""},null,null,null,null,null,null,"男"]
{"$rows_left_out":11}
{"sheet":"総体女子団体エントリー用紙","index":15,"n_rows":16,"n_cols":11,"rows_kept":16,"cut":false,"hidden":false,"merged":[[7,4,9,4],[5,1,5,7],[6,1,6,9],[15,1,15,6],[0,0,0,9],[5,8,5,9],[8,5,8,9],[7,5,7,9],[7,0,9,0],[7,3,9,3],[7,1,9,2],[3,0,3,9]]}
[{"$f":"設定情報!$B$1","v":"2022-04-01"}]
[]
["　　*　実施要項の \"７　競技方法\" および \"１０　エントリー方法\" を熟読の上、記入すること。"]
[{"$f":"設定情報!$B$3","v":"2022-05-24"}]
[]
["学校名",{"$f":"女子登録用紙!C5","v":""},null,null,null,null,null,null,"女"]
{"$rows_left_out":11}
{"sheet":"総体男子個人戦エントリー用紙","index":16,"n_rows":58,"n_cols":12,"rows_kept":58,"cut":false,"hidden":false,"merged":[[23,10,24,10],[13,10,14,10],[15,10,16,10],[17,10,18,10],[19,10,20,10],[21,10,22,10],[35,0,37,0],[35,3,37,3],[35,4,37,4],[34,1,34,7],[25,10,26,10],[27,10,28,10],[32,0,32,10],[35,1,37,2],[29,0,29,10],[34,8,34,10],[35,5,35,10],[36,5,36,9],[36,10,37,10],[0,0,0,10],[5,8,5,10],[9,0,10,0],[11,0,12,0],[7,10,8,10],[7,5,7,9],[6,5,6,10],[5,1,5,7],[9,10,10,10],[11,10,12,10],[6,3,8,3],[6,4,8,4],[6,0,8,0],[3,0,3,10],[6,1,8,2],[15,0,16,0],[13,0,14,0],[27,0,28,0],[25,0,26,0],[17,0,18,0],[19,0,20,0],[21,0,22,0],[23,0,24,0]]}
[{"$f":"設定情報!$B$1","v":"2022-04-01"}]
[]
["*個人戦ダブルス"]
[{"$f":"設定情報!$B$3","v":"2022-05-24"}]
[]
["学校名",{"$f":"男子登録用紙!C5","v":""},null,null,null,null,null,null,"男子"]
{"$rows_left_out":53}
{"sheet":"総体女子個人戦エントリー用紙","index":17,"n_rows":58,"n_cols":12,"rows_kept":58,"cut":false,"hidden":false,"merged":[[0,0,0,10],[5,8,5,10],[9,0,10,0],[11,0,12,0],[7,10,8,10],[11,10,12,10],[6,3,8,3],[6,4,8,4],[6,0,8,0],[3,0,3,10],[15,0,16,0],[7,5,7,9],[6,5,6,10],[5,1,5,7],[9,10,10,10],[13,0,14,0],[6,1,8,2],[27,0,28,0],[25,0,26,0],[17,0,18,0],[19,0,20,0],[21,0,22,0],[23,0,24,0],[29,0,29,10],[34,8,34,10],[35,5,35,10],[36,5,36,9],[36,10,37,10],[35,0,37,0],[35,3,37,3],[35,4,37,4],[34,1,34,7],[35,1,37,2],[32,0,32,10],[21,10,22,10],[23,10,24,10],[25,10,26,10],[27,10,28,10],[13,10,14,10],[15,10,16,10],[17,10,18,10],[19,10,20,10]]}
[{"$f":"設定情報!$B$1","v":"2022-04-01"}]
[]
["*個人戦ダブルス"]
[{"$f":"設定情報!$B$3","v":"2022-05-24"}]
[]
["学校名",{"$f":"女子登録用紙!C5","v":""},null,null,null,null,null,null,"女子"]
{"$rows_left_out":53}
{"sheet":"新人戦地区予選男子エントリー用紙","index":18,"n_rows":52,"n_cols":8,"rows_kept":52,"cut":false,"hidden":false,"merged":[[31,1,31,2],[0,0,0,5],[26,0,26,5],[4,1,4,4],[30,1,30,4],[6,0,7,0],[8,0,9,0],[10,0,11,0],[12,0,13,0],[24,0,25,0],[22,0,23,0],[14,0,15,0],[16,0,17,0],[18,0,19,0],[20,0,21,0],[5,1,5,2]]}
[{"$f":"設定情報!$B$1","v":"2022-04-01"}]
[]
["*個人戦ダブルス(各地区の申込期限を厳守のこと)"]
[]
["学校名",{"$f":"春季地区予選男子エントリー用紙!$B$5","v":""},null,null,null,"男",null,"部員名簿のNo欄の番号を入力してください。"]
["校内順位","選手氏名",null,"学年","生年月日","主な大会成績",null,"↓"]
{"$rows_left_out":47}
{"sheet":"新人戦地区予選女子エントリー用紙","index":19,"n_rows":52,"n_cols":8,"rows_kept":52,"cut":false,"hidden":false,"merged":[[31,1,31,2],[0,0,0,5],[26,0,26,5],[4,1,4,4],[30,1,30,4],[24,0,25,0],[22,0,23,0],[14,0,15,0],[16,0,17,0],[18,0,19,0],[20,0,21,0],[6,0,7,0],[8,0,9,0],[10,0,11,0],[12,0,13,0],[5,1,5,2]]}
[{"$f":"設定情報!$B$1","v":"2022-04-01"}]
[]
["*個人戦ダブルス(各地区の申込期限を厳守のこと)"]
[]
["学校名",{"$f":"女子登録用紙!C5","v":""},null,null,null,"女",null,"部員名簿のNo欄の番号を入力してください。"]
["校内順位","選手氏名",null,"学年","生年月日","主な大会成績",null,"↓"]
{"$rows_left_out":47}
{"sheet":"新人戦男子エントリー用紙","index":20,"n_rows":78,"n_cols":13,"rows_kept":78,"cut":false,"hidden":false,"merged":[[32,0,32,10],[62,0,62,10],[58,0,58,10],[63,1,63,7],[65,0,67,0],[65,1,67,2],[65,4,67,4],[65,3,67,3],[64,1,64,10],[35,5,35,10],[36,5,36,9],[36,10,37,10],[6,1,8,2],[21,10,22,10],[15,0,16,0],[15,10,16,10],[17,10,18,10],[19,10,20,10],[77,1,77,7],[63,8,63,10],[66,5,66,9],[66,10,67,10],[23,0,24,0],[34,1,34,7],[25,10,26,10],[27,10,28,10],[34,8,34,10],[35,0,37,0],[35,3,37,3],[35,4,37,4],[23,10,24,10],[29,0,29,10],[35,1,37,2],[65,5,65,10],[0,0,0,10],[5,8,5,10],[9,10,10,10],[11,10,12,10],[13,10,14,10],[6,4,8,4],[7,5,7,9],[9,0,10,0],[11,0,12,0],[5,1,5,7],[6,0,8,0],[6,3,8,3],[3,0,3,10],[6,5,6,10],[7,10,8,10],[13,0,14,0],[27,0,28,0],[25,0,26,0],[17,0,18,0],[19,0,20,0],[21,0,22,0]]}
[{"$f":"設定情報!$B$1","v":"2022-04-01"}]
[]
["*個人戦ダブルス"]
[{"$f":"設定情報!$B$4","v":"2022-09-06"}]
[]
["学校名",{"$f":"男子登録用紙!C5","v":""},null,null,null,null,null,null,"男"]
{"$rows_left_out":73}
{"sheet":"新人戦女子エントリー用紙","index":21,"n_rows":78,"n_cols":13,"rows_kept":78,"cut":false,"hidden":false,"merged":[[29,0,29,10],[34,8,34,10],[35,0,37,0],[34,1,34,7],[25,0,26,0],[36,5,36,9],[27,0,28,0],[25,10,26,10],[27,10,28,10],[35,5,35,10],[35,3,37,3],[36,10,37,10],[35,4,37,4],[35,1,37,2],[32,0,32,10],[23,0,24,0],[6,5,6,10],[13,0,14,0],[23,10,24,10],[6,0,8,0],[7,5,7,9],[17,10,18,10],[19,10,20,10],[21,10,22,10],[17,0,18,0],[15,10,16,10],[19,0,20,0],[9,0,10,0],[15,0,16,0],[21,0,22,0],[0,0,0,10],[5,8,5,10],[9,10,10,10],[11,10,12,10],[13,10,14,10],[5,1,5,7],[11,0,12,0],[7,10,8,10],[6,3,8,3],[6,4,8,4],[6,1,8,2],[3,0,3,10],[77,1,77,7],[63,8,63,10],[66,5,66,9],[66,10,67,10],[58,0,58,10],[65,0,67,0],[65,5,65,10],[65,1,67,2],[65,4,67,4],[65,3,67,3],[63,1,63,7],[64,1,64,10],[62,0,62,10]]}
[{"$f":"設定情報!$B$1","v":"2022-04-01"}]
[]
["*個人戦ダブルス"]
[{"$f":"設定情報!$B$4","v":"2022-09-06"}]
[]
["学校名",{"$f":"女子登録用紙!C5","v":""},null,null,null,null,null,null,"女"]
{"$rows_left_out":73}
{"sheet":"室内男子エントリー用紙","index":22,"n_rows":56,"n_cols":12,"rows_kept":56,"cut":false,"hidden":false,"merged":[[8,0,9,0],[10,0,11,0],[26,0,27,0],[24,0,25,0],[16,0,17,0],[34,3,35,3],[34,4,35,4],[12,0,13,0],[14,0,15,0],[33,1,33,7],[34,1,35,2],[18,0,19,0],[20,0,21,0],[22,0,23,0],[34,5,34,9],[28,0,28,9],[33,8,33,9],[34,0,35,0],[31,0,31,9],[0,0,0,9],[5,8,5,9],[6,0,7,0],[6,3,7,3],[6,4,7,4],[5,1,5,7],[6,1,7,2],[6,5,6,9],[3,0,3,9]]}
[{"$f":"設定情報!$B$1","v":"2022-04-01"}]
[]
["*個人戦ダブルス"]
[{"$f":"設定情報!$B$5","v":"2022-12-13"}]
[]
["学校名",{"$f":"男子登録用紙!C5","v":""},null,null,null,null,null,null,"男"]
{"$rows_left_out":51}
{"sheet":"室内女子エントリー用紙","index":23,"n_rows":56,"n_cols":12,"rows_kept":56,"cut":false,"hidden":false,"merged":[[0,0,0,9],[5,8,5,9],[5,1,5,7],[34,5,34,9],[6,5,6,9],[28,0,28,9],[33,8,33,9],[34,0,35,0],[6,3,7,3],[6,4,7,4],[34,3,35,3],[6,0,7,0],[16,0,17,0],[18,0,19,0],[12,0,13,0],[14,0,15,0],[34,1,35,2],[33,1,33,7],[34,4,35,4],[20,0,21,0],[22,0,23,0],[3,0,3,9],[31,0,31,9],[26,0,27,0],[24,0,25,0],[6,1,7,2],[8,0,9,0],[10,0,11,0]]}
[{"$f":"設定情報!$B$1","v":"2022-04-01"}]
[]
["*個人戦ダブルス"]
[{"$f":"設定情報!$B$5","v":"2022-12-13"}]
[]
["学校名",{"$f":"男子登録用紙!C5","v":""},null,null,null,null,null,null,"女"]
{"$rows_left_out":50}